Target
11-beta-hydroxysteroid dehydrogenase 1
Ligand
BDBM107670
Substrate
Meas. Tech.
Biological Assay Example 4
IC50
3.2±0.0 nM
Citation
 Renz, MSchuehle, MXu, Z Cyclic inhibitors of 11beta-hydroxysteroid dehydrogenase 1 US Patent  US8575157 Publication Date 11/5/2013 
Target
Name:
11-beta-hydroxysteroid dehydrogenase 1
Synonyms:
11-DH 11-beta-Hydroxysteroid Dehydrogenase 1 (11-beta-HSD1) 11-beta-hydroxysteroid dehydrogenase 1 (11HSD1) Corticosteroid 11-beta-dehydrogenase isozyme 1 (11-beta-HSD-1) Corticosteroid 11-beta-dehydrogenase isozyme 1 (11beta-HSD1) HSD11 HSD11L | SDR26C1
Type:
Enzyme
Mol. Mass.:
32409.16
Organism:
Homo sapiens (Human)
Description:
P28845
Residue:
292
  
Inhibitor
Name:
BDBM107670
Synonyms:
US8575157, 87
Type:
Small organic molecule
Emp. Form.:
C30H36N2O4
Mol. Mass.:
488.6178
SMILES:
CCCn1cc(ccc1=O)-c1ccc(cc1)[C@H](C)N1CC[C@@](CC(C)(C)O)(OC1=O)c1ccccc1
: