Target
Kynurenine/alpha-aminoadipate aminotransferase, mitochondrial
Ligand
BDBM107748
Substrate
Meas. Tech.
Inhibition Spectra Assay
IC50
74.7±0.0 nM
Citation
 Dounay, ABMcAllister, LParikh, VDRong, SVerhoest, PR KAT II inhibitors US Patent  US8598200 Publication Date 12/3/2013 
Target
Name:
Kynurenine/alpha-aminoadipate aminotransferase, mitochondrial
Synonyms:
2-aminoadipate aminotransferase AADAT Alpha-aminoadipate aminotransferase KAT2 Kynurenine aminotransferase II Kynurenine--oxoglutarate aminotransferase II Kynurenine--oxoglutarate transaminase II
Type:
Enzyme
Mol. Mass.:
47353.09
Organism:
Homo sapiens (Human)
Description:
Q8N5Z0
Residue:
425
  
Inhibitor
Name:
BDBM107748
Synonyms:
US8933095, 7
Type:
Small organic molecule
Emp. Form.:
C13H11F3N4O2
Mol. Mass.:
312.2472
SMILES:
N[C@H]1Cc2cn(nc2N(O)C1=O)-c1cccc(c1)C(F)(F)F
: