Target
Xanthine dehydrogenase/oxidase
Ligand
BDBM50100861
Substrate
Meas. Tech.
Xanthine Oxidase Activity
pH
7.6±n/a
Temperature
298.15±n/a K
IC50
5.8e+3± 4e+2 nM
Comments
extracted
Citation
 Nile, SHPark, SW Antioxidant, a-glucosidase and xanthine oxidase inhibitory activity of bioactive compounds from maize (Zea mays L.). Chem Biol Drug Des 83:119-25 (2014)  
Target
Name:
Xanthine dehydrogenase/oxidase
Synonyms:
XDH Xanthine dehydrogenase Xanthine oxidase (XO)
Type:
Protein
Mol. Mass.:
146809.00
Organism:
Bos taurus (Bovine)
Description:
P80457
Residue:
1332
  
Inhibitor
Name:
BDBM50100861
Synonyms:
3,4-Dihydroxybenzoate, VIII 4,5-Dihydroxybenzoic acid CHEMBL37537 Protocatechuic acid (M1) cid_72
Type:
Small organic molecule
Emp. Form.:
C7H6O4
Mol. Mass.:
154.1201
SMILES:
OC(=O)c1ccc(O)c(O)c1
: