Target
Tyrosine-protein kinase ABL1
Ligand
BDBM108057
Substrate
Meas. Tech.
Z-LYTE biochemical assay
Temperature
298.15±n/a K
IC50
3.2e+2±n/a nM
Comments
extracted
Citation
 Jia, YZhang, JFeng, JXu, FPan, HXu, W Design, synthesis and biological evaluation of pazopanib derivatives as antitumor agents. Chem Biol Drug Des 83:306-16 (2014)  
Target
Name:
Tyrosine-protein kinase ABL1
Synonyms:
ABL ABL1_HUMAN JTK7 Proto-oncogene tyrosine-protein kinase ABL1 Tyrosine-protein kinase ABL V-abl Abelson murine leukemia viral oncogene homolog 1 p150 | tyrosine-protein kinase ABL1 isoform a
Type:
Enzyme
Mol. Mass.:
122897.30
Organism:
Homo sapiens (Human)
Description:
P00519
Residue:
1130
  
Inhibitor
Name:
BDBM108057
Synonyms:
4-((4-((2,3-dimethyl-2H-indazole-6-yl)(methyl) amino)pyrimidin-2-yl)amino)-N-(5-methylisoxazol- 3-yl)benzenesulfonamide (P2f)
Type:
Small organic molecule
Emp. Form.:
C24H24N8O3S
Mol. Mass.:
504.564
SMILES:
CN(c1ccc2c(C)n(C)nc2c1)c1ccnc(Nc2ccc(cc2)S(=O)(=O)Nc2cc(C)on2)n1
: