Target
Tyrosine-protein kinase ABL1
Ligand
BDBM108058
Substrate
Meas. Tech.
Z-LYTE biochemical assay
Temperature
298.15±n/a K
IC50
9.3e+2±n/a nM
Comments
extracted
Citation
 Jia, YZhang, JFeng, JXu, FPan, HXu, W Design, synthesis and biological evaluation of pazopanib derivatives as antitumor agents. Chem Biol Drug Des 83:306-16 (2014)  
Target
Name:
Tyrosine-protein kinase ABL1
Synonyms:
ABL ABL1_HUMAN JTK7 Proto-oncogene tyrosine-protein kinase ABL1 Tyrosine-protein kinase ABL V-abl Abelson murine leukemia viral oncogene homolog 1 p150 | tyrosine-protein kinase ABL1 isoform a
Type:
Enzyme
Mol. Mass.:
122897.30
Organism:
Homo sapiens (Human)
Description:
P00519
Residue:
1130
  
Inhibitor
Name:
BDBM108058
Synonyms:
N-carbamimidoyl-4-((4-((2,3-dimethyl-2H-indazole- 6-yl)amino)pyrimidin-2-yl)amino) benzenesulfonamide (P1g)
Type:
Small organic molecule
Emp. Form.:
C20H21N9O2S
Mol. Mass.:
451.505
SMILES:
Cc1n(C)nc2cc(Nc3ccnc(Nc4ccc(cc4)S(=O)(=O)NC(N)=N)n3)ccc12
: