Target
Epidermal growth factor receptor
Ligand
BDBM4404
Substrate
Poly(GAT)
Meas. Tech.
EGFR assay
IC50
1000±n/a nM
Citation
 Gazit, AChen, JApp, HMcMahon, GHirth, PChen, ILevitzki, A Tyrphostins IV--highly potent inhibitors of EGF receptor kinase. Structure-activity relationship study of 4-anilidoquinazolines. Bioorg Med Chem 4:1203-7 (1996)  
Target
Name:
Epidermal growth factor receptor
Synonyms:
EGF Receptor Substrate EGFR_HUMAN ERBB1 Epidermal Growth Factor Receptor erbB-1 Epidermal growth factor receptor (EGFR) HER1 Proto-oncogene c-ErbB-1 Tyrosine-Protein Kinase ErbB-1
Type:
Receptor Kinase Domain
Mol. Mass.:
134279.59
Organism:
Homo sapiens (Human)
Description:
P00533
Residue:
1210
  
Inhibitor
Name:
BDBM4404
Synonyms:
3-[(6-methylquinazolin-4-yl)amino]benzoic acid | 4-Anilidoquinazoline deriv. 20a
Type:
Small organic molecule
Emp. Form.:
C16H13N3O2
Mol. Mass.:
279.2933
SMILES:
Cc1ccc2ncnc(Nc3cccc(c3)C(O)=O)c2c1
:
Substrate
Name:
Poly(GAT)
Synonyms:
Type:
Peptide
Mol. Mass.:
358.43
Organism:
Description:
poly(Glu6Ala3Tyr). 125 uM [gamma-32P]ATP as co-substrate.
Residue:
3
NA