Target
Epidermal growth factor receptor
Ligand
BDBM4416
Substrate
Poly(GAT)
Meas. Tech.
EGFR assay
IC50
>50000±n/a nM
Citation
 Gazit, AChen, JApp, HMcMahon, GHirth, PChen, ILevitzki, A Tyrphostins IV--highly potent inhibitors of EGF receptor kinase. Structure-activity relationship study of 4-anilidoquinazolines. Bioorg Med Chem 4:1203-7 (1996)  
Target
Name:
Epidermal growth factor receptor
Synonyms:
EGF Receptor Substrate EGFR_HUMAN ERBB1 Epidermal Growth Factor Receptor erbB-1 Epidermal growth factor receptor (EGFR) HER1 Proto-oncogene c-ErbB-1 Tyrosine-Protein Kinase ErbB-1
Type:
Receptor Kinase Domain
Mol. Mass.:
134279.59
Organism:
Homo sapiens (Human)
Description:
P00533
Residue:
1210
  
Inhibitor
Name:
BDBM4416
Synonyms:
4-Anilidoquinazoline deriv. 32b | 6,7-dimethoxy-2-N,4-N-bis(4-methylphenyl)quinazoline-2,4-diamine
Type:
Small organic molecule
Emp. Form.:
C24H24N4O2
Mol. Mass.:
400.473
SMILES:
COc1cc2nc(Nc3ccc(C)cc3)nc(Nc3ccc(C)cc3)c2cc1OC
:
Substrate
Name:
Poly(GAT)
Synonyms:
Type:
Peptide
Mol. Mass.:
358.43
Organism:
Description:
poly(Glu6Ala3Tyr). 125 uM [gamma-32P]ATP as co-substrate.
Residue:
3
NA