Target
Vitamin K-dependent protein C
Ligand
BDBM108117
Substrate
Meas. Tech.
Inhibition Assay
Ki
600±0.0 nM
Citation
 Herold, PDaghish, MJelakovic, SLudwig, FReichelt, CSchulze, ASchweinitz, A Trypsin-like serine protease inhibitors, and their preparation and use US Patent  US8598206 Publication Date 12/3/2013 
Target
Name:
Vitamin K-dependent protein C
Synonyms:
Activated protein C cofactor Apolipoprotein H Blood coagulation factor XIV Coagulation factor V heavy chain Endothelial protein C receptor PROC_HUMAN Vitamin K-dependent protein C precursor
Type:
Enzyme
Mol. Mass.:
52067.73
Organism:
Homo sapiens (Human)
Description:
Residue:
461
  
Inhibitor
Name:
BDBM108117
Synonyms:
US8598206, Table 6, 2
Type:
Small organic molecule
Emp. Form.:
C34H45N7O4S
Mol. Mass.:
647.831
SMILES:
NC(=N)c1ccc(CNC(=O)[C@H](CCC2CCNCC2)NC(=O)[C@@H](CCCc2ccncc2)NS(=O)(=O)Cc2ccccc2)cc1
: