Target
Alpha-galactosidase
Ligand
BDBM108225
Substrate
Meas. Tech.
Inhibition Assay Against Commercial Glycosidases
pH
10.6±n/a
Temperature
310.15±n/a K
IC50
4.71e+3±n/a nM
Comments
extracted
Citation
 Li, ZLi, TDai, SXie, XMa, XZhao, WZhang, WLi, JWang, PG New insights into the pharmacological chaperone activity of c2-substituted glucoimidazoles for the treatment of Gaucher disease. Chembiochem 14:1239-47 (2013)  
Target
Name:
Alpha-galactosidase
Synonyms:
α-galactosidase Alpha-galactosidase
Type:
Protein
Mol. Mass.:
41306.82
Organism:
Coffea arabica (Coffee beans)
Description:
Residue:
378
  
Inhibitor
Name:
BDBM108225
Synonyms:
2,2-dimethyl-N-phenyl-5-[6,7,8-trihydroxy-5- (hydroxymethyl)-5H,6H,7H,8H-imidazo[1,2-a]pyridin-2- yl]pentanamide (Compound 11)
Type:
Small organic molecule
Emp. Form.:
C21H29N3O5
Mol. Mass.:
403.4721
SMILES:
CC(C)(CCCc1cn2C(CO)C(O)C(O)C(O)c2n1)C(=O)Nc1ccccc1
: