Target
1-deoxy-D-xylulose-5-phosphate synthase
Ligand
BDBM50065935
Substrate
Meas. Tech.
DXP Synthase Inhibition Assay
pH
8±n/a
Temperature
310.15±n/a K
IC50
2.08e+5± 2.0e+4 nM
Comments
extracted
Citation
 Morris, FVierling, RBoucher, LBosch, JFreel Meyers, CL DXP synthase-catalyzed C-N bond formation: nitroso substrate specificity studies guide selective inhibitor design. Chembiochem 14:1309-15 (2013)  
Target
Name:
1-deoxy-D-xylulose-5-phosphate synthase
Synonyms:
1-Deoxy-D-xylulose-5-phosphate synthase (DXP synthase)) dxs | yajP
Type:
Protein
Mol. Mass.:
67617.17
Organism:
Escherichia coli K-12 (Enterobacteria)
Description:
Residue:
620
  
Inhibitor
Name:
BDBM50065935
Synonyms:
CHEMBL98797 Nitrosobenzene (Substrate 1) | nitrosobenzene
Type:
Small organic molecule
Emp. Form.:
C6H5NO
Mol. Mass.:
107.11
SMILES:
O=Nc1ccccc1
: