Target
Cell surface glycoprotein MUC18
Ligand
BDBM50031467
Substrate
Meas. Tech.
Mushroom Tyrosinase Assay
Temperature
298.15±n/a K
IC50
20000±n/a nM
Comments
extracted
Citation
 Nandy, SKLiu, JNesterov, AMHertel, CPapmapiya, AA Series of skin-whitening (lightening) compounds US Patent  US9682910 Publication Date 6/20/2017 
Target
Name:
Cell surface glycoprotein MUC18
Synonyms:
Gicerin Mcam Melanoma-associated antigen MUC18 | Muc18
Type:
Protein
Mol. Mass.:
71536.56
Organism:
Mouse
Description:
Q8R2Y2
Residue:
648
  
Inhibitor
Name:
BDBM50031467
Synonyms:
5-HYDROXY-2-(HYDROXYMETHYL)-4H-PYRAN-4-ONE CHEMBL287556 US10857082, Kojic acid US9682910, kojic acid
Type:
Small organic molecule
Emp. Form.:
C6H6O4
Mol. Mass.:
142.1094
SMILES:
OCc1cc(=O)c(O)co1
: