Target
Tyrosine-protein kinase BTK
Ligand
BDBM281754
Substrate
Meas. Tech.
Human Recombinant Btk Enzyme Assay
pH
7.4±n/a
Temperature
298.15±n/a K
IC50
0.073±n/a nM
Comments
extracted
Citation
 Watterson, SHTebben, AJAhmad, S Carbazole and tetrahydrocarbazole compounds useful as inhibitors of BTK US Patent  US10023534 Publication Date 7/17/2018 
Target
Name:
Tyrosine-protein kinase BTK
Synonyms:
AGMX1 Agammaglobulinaemia tyrosine kinase B cell progenitor kinase BPK BTK_HUMAN Tyrosine Kinase BTK Tyrosine-protein kinase BTK (BTK)
Type:
Enzyme
Mol. Mass.:
76289.95
Organism:
Homo sapiens (Human)
Description:
Q06187
Residue:
659
  
Inhibitor
Name:
BDBM281754
Synonyms:
US10023534, Example 13 | US10023534, Example 14
Type:
Small organic molecule
Emp. Form.:
C24H18FN3O2S
Mol. Mass.:
431.482
SMILES:
NC(=O)c1cc(F)c(-c2cccc3N(CCSc23)C(=O)C=C)c2c3ccccc3[nH]c12
: