Target
Lysosomal acid glucosylceramidase
Ligand
BDBM108417
Substrate
Meas. Tech.
Enzyme Inhibition Assay
pH
7±0
Ki
3.06± 0.12 nM
IC50
5.8± 0.23 nM
Citation
 Boyd, RLee, GRybczynski, P Compositions for preventing and/or treating degenerative disorders of the central nervous system US Patent  US8604206 Publication Date 12/10/2013 
Target
Name:
Lysosomal acid glucosylceramidase
Synonyms:
Acid beta-glucosidase Beta-glucocerebrosidase D-glucosyl-N-acylsphingosine glucohydrolase GBA1 GC GLUC Glucosylceramidase (GBA) Glucosylceramidase precursor (Beta-glucocerebrosidase) (Acid beta-glucosidase) (D-glucosyl-N-acylsphingosine glucohydrolase) (Alglucerase) (Imiglucerase) beta-glucocerebrosidase (GCase)
Type:
Enzyme
Mol. Mass.:
59724.64
Organism:
Homo sapiens (Human)
Description:
The beta-Glu activity was measured with commercially available beta-glucocerebrosidase (Ceredase) as the enzyme source.
Residue:
536
  
Inhibitor
Name:
BDBM108417
Synonyms:
US8604206, 6
Type:
Small organic molecule
Emp. Form.:
C6H11F2NO2
Mol. Mass.:
167.1538
SMILES:
O[C@@H]1CNC[C@H](C(F)F)[C@H]1O
: