Target
Aldehyde dehydrogenase, dimeric NADP-preferring
Ligand
BDBM109227
Substrate
Meas. Tech.
IC50 Determination
IC50
2.69e+4± 6.0e+3 nM
Citation
 Parajuli, BGeorgiadis, TMFishel, MLHurley, TD Development of Selective Inhibitors for Human Aldehyde Dehydrogenase 3A1 (ALDH3A1) for the Enhancement of Cyclophosphamide Cytotoxicity. Chembiochem 15:701-712 (2014)  
Target
Name:
Aldehyde dehydrogenase, dimeric NADP-preferring
Synonyms:
AL3A1_HUMAN ALDH3A1 Aldehyde dehydrogenase family 3 member A1 (ALDH3A1) | Aldehyde dehydrogenase family 3 member A1 (ALDH3A1) (Q122A)
Type:
Protein
Mol. Mass.:
50394.38
Organism:
Homo sapiens (Human)
Description:
Residue:
453
  
Inhibitor
Name:
BDBM109227
Synonyms:
CB29 (derivative 17)
Type:
Small organic molecule
Emp. Form.:
C16H16N2O4S
Mol. Mass.:
332.374
SMILES:
CS(=O)(=O)c1ccc(Nc2ccc3CCCc3c2)c(c1)[N+]([O-])=O
: