Target
Aldehyde dehydrogenase 1A1
Ligand
BDBM109223
Substrate
Meas. Tech.
IC50 Determination
IC50
1.16e+4± 6e+3 nM
Citation
 Parajuli, BGeorgiadis, TMFishel, MLHurley, TD Development of Selective Inhibitors for Human Aldehyde Dehydrogenase 3A1 (ALDH3A1) for the Enhancement of Cyclophosphamide Cytotoxicity. Chembiochem 15:701-712 (2014)  
Target
Name:
Aldehyde dehydrogenase 1A1
Synonyms:
AL1A1_HUMAN ALDH-E1 ALDH1A1 Aldehyde dehydrogenase 1A1 (ALDH1A1) Aldehyde dehydrogenase family 1 member A1 (ALDH1A1) PUMB1 RalDH1 | Retinal dehydrogenase 1
Type:
Protein
Mol. Mass.:
54862.21
Organism:
Homo sapiens (Human)
Description:
Residue:
501
  
Inhibitor
Name:
BDBM109223
Synonyms:
CB29 (derivative 13)
Type:
Small organic molecule
Emp. Form.:
C18H22N4O5S
Mol. Mass.:
406.456
SMILES:
CNS(=O)(=O)c1ccc(Nc2ccc(NC(=O)CC(C)C)cc2)c(c1)[N+]([O-])=O
: