Target
Induced myeloid leukemia cell differentiation protein Mcl-1
Ligand
BDBM109234
Substrate
Meas. Tech.
AlphaScreen Assay (AS)
pH
7.4±n/a
Temperature
298.15±n/a K
IC50
80000±3000 nM
Comments
extracted
Citation
 Lessene, GCzabotar, PESleebs, BEZobel, KLowes, KNAdams, JMBaell, JBColman, PMDeshayes, KFairbrother, WJFlygare, JAGibbons, PKersten, WJKulasegaram, SMoss, RMParisot, JPSmith, BJStreet, IPYang, HHuang, DCWatson, KG Structure-guided design of a selective BCL-X(L) inhibitor. Nat Chem Biol 9:390-7 (2013)  
Target
Name:
Induced myeloid leukemia cell differentiation protein Mcl-1
Synonyms:
BCL2L3 Bcl-2-like protein 3 (Mcl-1) Bcl2-L-3 MCL1 Mcl-1 Myeloid cell leukemia sequence 1 (BCL2-related) | mcl1/EAT
Type:
Membrane; Single-pass membrane protein
Mol. Mass.:
37332.87
Organism:
Homo sapiens (Human)
Description:
Q07820
Residue:
350
  
Inhibitor
Name:
BDBM109234
Synonyms:
6-(8-(2-(Benzo[d]thiazol-2-yl)hydrazono)-5,6,7,8-tetrahydronaphthalen-2-yl)-3-(3-phenoxypropoxy)picolinic acid (Compound 5)
Type:
Small organic molecule
Emp. Form.:
C32H28N4O4S
Mol. Mass.:
564.654
SMILES:
OC(=O)c1nc(ccc1OCCCOc1ccccc1)-c1ccc2CCCC(=NNc3nc4ccccc4s3)c2c1
: