Target
Bcl-2-like protein 2
Ligand
BDBM21447
Substrate
Meas. Tech.
SPR Directy Binding Assay (Biacore 4000)
pH
7.4±n/a
IC50
66±5 nM
Comments
extracted
Citation
 Lessene, GCzabotar, PESleebs, BEZobel, KLowes, KNAdams, JMBaell, JBColman, PMDeshayes, KFairbrother, WJFlygare, JAGibbons, PKersten, WJKulasegaram, SMoss, RMParisot, JPSmith, BJStreet, IPYang, HHuang, DCWatson, KG Structure-guided design of a selective BCL-X(L) inhibitor. Nat Chem Biol 9:390-7 (2013)  
Target
Name:
Bcl-2-like protein 2
Synonyms:
Apoptosis regulator Bcl-W BCL-W BCLW Bcl2-L-2 | KIAA0271
Type:
Protein
Mol. Mass.:
20742.61
Organism:
Homo sapiens (Human)
Description:
Residue:
193
  
Inhibitor
Name:
BDBM21447
Synonyms:
4-(4-{[2-(4-chlorophenyl)phenyl]methyl}piperazin-1-yl)-N-[(4-{[(2R)-4-(dimethylamino)-1-(phenylsulfanyl)butan-2-yl]amino}-3-nitrobenzene)sulfonyl]benzamide CHEMBL376408 US11760752, Compound ABT-737 | US9125913, ABT-737
Type:
Small organic molecule
Emp. Form.:
C42H45ClN6O5S2
Mol. Mass.:
813.427
SMILES:
CN(C)CC[C@H](CSc1ccccc1)Nc1ccc(cc1[N+]([O-])=O)S(=O)(=O)NC(=O)c1ccc(cc1)N1CCN(Cc2ccccc2-c2ccc(Cl)cc2)CC1
: