Target
Carboxypeptidase B2
Ligand
BDBM109245
Substrate
Meas. Tech.
Enzyme Inhibition Assay
IC50
18±n/a nM
Citation
 Nagata, TInoue, MAshida, YNoguchi, KOno, M Cycloalkyl-substituted imidazole derivative US Patent  US8609710 Publication Date 12/17/2013 
Target
Name:
Carboxypeptidase B2
Synonyms:
CBPB2_HUMAN CPU Carboxypeptidase B2 isoform A Plasma carboxypeptidase B Thrombin-activable fibrinolysis inhibitor | pCPB
Type:
Enzyme
Mol. Mass.:
48432.74
Organism:
Homo sapiens (Human)
Description:
Q96IY4
Residue:
423
  
Inhibitor
Name:
BDBM109245
Synonyms:
US8609710, 9
Type:
Small organic molecule
Emp. Form.:
C16H27N3O2
Mol. Mass.:
293.4045
SMILES:
CC1CCCC(C1)n1cnc(CC(CCCN)C(O)=O)c1
: