Target
Serine protease 1
Ligand
BDBM109710
Substrate
Meas. Tech.
Inhibition Assay
Ki
0.2±0.0 nM
Citation
 Konishi, ATokumasu, MSuzuki, TKoshiba, TOhsumi, KIkehara, OKodama, Y Heteroarylcarboxylic acid ester derivative US Patent  US8609715 Publication Date 12/17/2013 
Target
Name:
Serine protease 1
Synonyms:
Alpha-trypsin chain 1 Beta-trypsin PRSS1 TRP1 TRY1_HUMAN Thrombin & trypsin Trypsin I | Trypsin-1
Type:
Enzyme
Mol. Mass.:
26557.80
Organism:
Homo sapiens (Human)
Description:
P07477
Residue:
247
  
Inhibitor
Name:
BDBM109710
Synonyms:
US8609715, C-4
Type:
Small organic molecule
Emp. Form.:
C19H19FN4O7S
Mol. Mass.:
466.44
SMILES:
CC(Cc1ncc(s1)C(=O)Oc1ccc(cc1F)C(N)=N)C(=O)N[C@@H](CC(O)=O)C(O)=O
: