Target
Tyrosine-protein kinase JAK3
Ligand
BDBM109868
Substrate
Meas. Tech.
Inhibition Assay
IC50
21±n/a nM
Citation
 Noji, SShiozaki, MMiura, THara, YYamanaka, HMaeda, KHori, AInoue, MHase, Y Nitrogen-containing spirocyclic compounds and pharmaceutical uses thereof US Patent  US8609647 Publication Date 12/17/2013 
Target
Name:
Tyrosine-protein kinase JAK3
Synonyms:
JAK-3 JAK3_HUMAN Janus kinase 3 (JAK3) L-JAK | Leukocyte janus kinase
Type:
Protein
Mol. Mass.:
125111.08
Organism:
Homo sapiens (Human)
Description:
P52333
Residue:
1124
  
Inhibitor
Name:
BDBM109868
Synonyms:
US8609647, 19 US8609647, 6
Type:
Small organic molecule
Emp. Form.:
C16H18N6O
Mol. Mass.:
310.3537
SMILES:
CC1CN(C(=O)CC#N)C11CCN(C1)c1ncnc2[nH]ccc12
: