Target
Proto-oncogene tyrosine-protein kinase Src
Ligand
BDBM4500
Substrate
cdc2 substrate peptide
Meas. Tech.
Kinase Inhibition Assay
pH
7.5±n/a
Temperature
303.15±n/a K
IC50
1200±n/a nM
Citation
 Boschelli, DHWang, YDYe, FWu, BZhang, NDutia, MPowell, DWWissner, AArndt, KWeber, JMBoschelli, F Synthesis and Src kinase inhibitory activity of a series of 4-phenylamino-3-quinolinecarbonitriles. J Med Chem 44:822-33 (2001)  
Target
Name:
Proto-oncogene tyrosine-protein kinase Src
Synonyms:
Calmodulin/Proto-oncogene tyrosine-protein kinase Src Proto-oncogene c-Src SRC SRC_HUMAN V-src sarcoma (Schmidt-Ruppin A-2) viral oncogene homolog (avian) p60-Src | pp60c-src
Type:
Protein
Mol. Mass.:
59838.60
Organism:
Homo sapiens (Human)
Description:
P12931
Residue:
536
  
Inhibitor
Name:
BDBM4500
Synonyms:
3-quinolinecarbonitrile deriv. 2c 4-[(2,4-dichlorophenyl)amino]-5-methoxyquinoline-3-carbonitrile
Type:
Small organic molecule
Emp. Form.:
C17H11Cl2N3O
Mol. Mass.:
344.195
SMILES:
COc1cccc2ncc(C#N)c(Nc3ccc(Cl)cc3Cl)c12
:
Substrate
Name:
cdc2 substrate peptide
Synonyms:
Type:
Peptide
Mol. Mass.:
358.43
Organism:
Description:
100 uM ATP as co-substrate
Residue:
3
NA