Target
Tyrosine-protein kinase JAK2
Ligand
BDBM112586
Substrate
Meas. Tech.
Inhibition Assay
pH
7.2±n/a
IC50
0.0603±n/a nM
Citation
 de Vicente Fidalgo, JHermann, JCLemoine, RLi, HLovey, AJSjogren, EBSoth, M Inhibitors of JAK US Patent  US8618103 Publication Date 12/31/2013 
Target
Name:
Tyrosine-protein kinase JAK2
Synonyms:
JAK-2 JAK2_HUMAN Janus kinase 2 (JAK2) | Janus kinase 2 (a protein tyrosine kinase)
Type:
Protein
Mol. Mass.:
130684.68
Organism:
Homo sapiens (Human)
Description:
O60674
Residue:
1132
  
Inhibitor
Name:
BDBM112586
Synonyms:
US8618103, I-82
Type:
Small organic molecule
Emp. Form.:
C21H29N9O2S
Mol. Mass.:
471.579
SMILES:
CN1CCN(CC1)c1ncc(c(N[C@H]2CCCN(C2)S(C)(=O)=O)n1)-c1cnc2[nH]ccc2n1
: