Target
Dopa decarboxylase (Aromatic L-amino acid decarboxylase), isoform CRA_a
Ligand
BDBM48449
Substrate
Meas. Tech.
DDC-MDH-PEPC-Linked assay
pH
8.05±n/a
Temperature
310.15±n/a K
IC50
1.200e+6± 3.9e+3 nM
Comments
extracted
Citation
 Ren, JZhang, YJin, HYu, JZhou, YWu, FZhang, W Novel inhibitors of human DOPA decarboxylase extracted from Euonymus glabra Roxb. ACS Chem Biol 9:897-903 (2014)  
Target
Name:
Dopa decarboxylase (Aromatic L-amino acid decarboxylase), isoform CRA_a
Synonyms:
Aromatic-L-amino-acid decarboxylase DOPA decarboxylase (DDC)
Type:
Protein
Mol. Mass.:
53899.74
Organism:
Homo sapiens (Human)
Description:
Residue:
480
  
Inhibitor
Name:
BDBM48449
Synonyms:
3-(3,4-DIHYDROXYPHENYL)-2-METHYL-L-ALANINE MLS000028644 cid_38853
Type:
Small organic molecule
Emp. Form.:
C10H13NO4
Mol. Mass.:
211.2145
SMILES:
C[C@](N)(Cc1ccc(O)c(O)c1)C(O)=O
: