Target
Dopa decarboxylase (Aromatic L-amino acid decarboxylase), isoform CRA_a
Ligand
BDBM112630
Substrate
Meas. Tech.
DDC-MDH-PEPC-Linked assay
pH
8.05±n/a
Temperature
310.15±n/a K
IC50
>2.00e+5±n/a nM
Comments
extracted
Citation
 Ren, JZhang, YJin, HYu, JZhou, YWu, FZhang, W Novel inhibitors of human DOPA decarboxylase extracted from Euonymus glabra Roxb. ACS Chem Biol 9:897-903 (2014)  
Target
Name:
Dopa decarboxylase (Aromatic L-amino acid decarboxylase), isoform CRA_a
Synonyms:
Aromatic-L-amino-acid decarboxylase DOPA decarboxylase (DDC)
Type:
Protein
Mol. Mass.:
53899.74
Organism:
Homo sapiens (Human)
Description:
Residue:
480
  
Inhibitor
Name:
BDBM112630
Synonyms:
Euonydiarylpropane C (3)
Type:
Small organic molecule
Emp. Form.:
C34H38O8
Mol. Mass.:
574.6607
SMILES:
COc1ccc(C(CCc2ccc(O)c(OC)c2)c2cc(CCCc3ccc(O)c(OC)c3)c(O)cc2OC)c(O)c1
: