Target
Gag-Pol polyprotein [484-582,Q491K,I494L,I497V,V499I,E519D,R541K,D544E,Q553K,L573M]
Ligand
BDBM112658
Substrate
Meas. Tech.
HIV-1 protease inhibition assay
pH
4.7±n/a
Temperature
298.15±n/a K
Ki
0.019±0.023 nM
Comments
extracted
Citation
 Nalam, MNAli, AReddy, GSCao, HAnjum, SGAltman, MDYilmaz, NKTidor, BRana, TMSchiffer, CA Substrate envelope-designed potent HIV-1 protease inhibitors to avoid drug resistance. Chem Biol 20:1116-24 (2013)  
Target
Name:
Gag-Pol polyprotein [484-582,Q491K,I494L,I497V,V499I,E519D,R541K,D544E,Q553K,L573M]
Synonyms:
HIV-1 protease (Wt) gag-pol
Type:
Protein
Mol. Mass.:
10758.73
Organism:
Human immunodeficiency virus
Description:
wild-type HIV-1 protease (Q7K)
Residue:
99
  
Inhibitor
Name:
BDBM112658
Synonyms:
(3R,3aS,6aR)-Hexahydrofuro[2,3-b]furan-3-yl ((2S,3R)-3-hydroxy-4-(N-((S)-2-methylbutyl)benzo[d]thiazole-6-sulfonamido)-1-phenylbutan-2-yl)carbamate (10e)
Type:
Small organic molecule
Emp. Form.:
C29H37N3O7S2
Mol. Mass.:
603.75
SMILES:
CC[C@H](C)CN(C[C@@H](O)[C@H](Cc1ccccc1)NC(=O)O[C@H]1CO[C@H]2OCC[C@@H]12)S(=O)(=O)c1ccc2ncsc2c1
: