Target
E3 ubiquitin-protein ligase Mdm2
Ligand
BDBM112737
Substrate
Meas. Tech.
Binding Assay
Ki
1.0±03 nM
IC50
15.6±2.2 nM
Citation
 Wang, SSun, WAguilar, AGarcia-Echeverria, C Spiro-oxindole MDM2 antagonists US Patent  US8629141 Publication Date 1/14/2014 
Target
Name:
E3 ubiquitin-protein ligase Mdm2
Synonyms:
Double minute 2 protein E3 ubiquitin-protein ligase Mdm2 (p53-binding protein Mdm2) Human Double Minute 2 (HDM2) MDM2-MDMX p53-Binding Protein MDM2 | p53-binding protein
Type:
Oncoprotein
Mol. Mass.:
55196.54
Organism:
Homo sapiens (Human)
Description:
Q00987
Residue:
491
  
Inhibitor
Name:
BDBM112737
Synonyms:
US8629141, 4
Type:
Small organic molecule
Emp. Form.:
C30H34Cl2FN3O3
Mol. Mass.:
574.514
SMILES:
O[C@H]1CCC(CC1)NC(=O)[C@@H]1NC2(CCCCCC2)[C@]2([C@H]1c1cccc(Cl)c1F)C(=O)Nc1cc(Cl)ccc21
: