Target
Androgen receptor
Ligand
BDBM112820
Substrate
Meas. Tech.
Biological Assay
IC50
5.9±n/a nM
Citation
 Miller, CP Selective androgen receptor modulators US Patent  US8629167 Publication Date 1/14/2014 
Target
Name:
Androgen receptor
Synonyms:
ANDR_RAT Ar Nr3c4 | androgen
Type:
Enzyme
Mol. Mass.:
98219.08
Organism:
Rattus norvegicus (Rat)
Description:
P15207
Residue:
902
  
Inhibitor
Name:
BDBM112820
Synonyms:
US8629167, 31
Type:
Small organic molecule
Emp. Form.:
C21H16F3N5O2
Mol. Mass.:
427.3792
SMILES:
C[C@@H](O)[C@@H](Nc1ccc(C#N)c(c1C)C(F)(F)F)c1nnc(o1)-c1ccc(cc1)C#N
: