Target
Proto-oncogene tyrosine-protein kinase Src
Ligand
BDBM4562
Substrate
cdc2 substrate peptide
Meas. Tech.
Kinase Inhibition Assay
IC50
1.9±n/a nM
Citation
 Boschelli, DHYe, FWang, YDDutia, MJohnson, SLWu, BMiller, KPowell, DWYaczko, DYoung, MTischler, MArndt, KDiscafani, CEtienne, CGibbons, JGrod, JLucas, JWeber, JMBoschelli, F Optimization of 4-phenylamino-3-quinolinecarbonitriles as potent inhibitors of Src kinase activity. J Med Chem 44:3965-77 (2001)  
Target
Name:
Proto-oncogene tyrosine-protein kinase Src
Synonyms:
Calmodulin/Proto-oncogene tyrosine-protein kinase Src Proto-oncogene c-Src SRC SRC_HUMAN V-src sarcoma (Schmidt-Ruppin A-2) viral oncogene homolog (avian) p60-Src | pp60c-src
Type:
Protein
Mol. Mass.:
59838.60
Organism:
Homo sapiens (Human)
Description:
P12931
Residue:
536
  
Inhibitor
Name:
BDBM4562
Synonyms:
4-Phenylamino-3-quinolinecarbonitrile deriv. 31k 4-[(2,4-dichloro-5-methoxyphenyl)amino]-6-methoxy-7-[3-(1H-1,2,3-triazol-1-yl)propoxy]quinoline-3-carbonitrile
Type:
Small organic molecule
Emp. Form.:
C23H20Cl2N6O3
Mol. Mass.:
499.349
SMILES:
COc1cc(Nc2c(cnc3cc(OCCCn4ccnn4)c(OC)cc23)C#N)c(Cl)cc1Cl
:
Substrate
Name:
cdc2 substrate peptide
Synonyms:
Type:
Peptide
Mol. Mass.:
358.43
Organism:
Description:
100 uM ATP as co-substrate
Residue:
3
NA