Target
Tyrosine-protein kinase JAK2
Ligand
BDBM113214
Substrate
Meas. Tech.
Enzymatic Assay
pH
7.4±n/a
IC50
0.0199±n/a nM
Comments
extracted
Citation
 Promo, MAXie, JAcker, BAHartmann, SJWolfson, SGHuang, HJacobsen, EJ Pyrrolo[2,3-D]pyrimidine compounds US Patent  US8633206 Publication Date 1/21/2014 
Target
Name:
Tyrosine-protein kinase JAK2
Synonyms:
JAK-2 JAK2_HUMAN Janus kinase 2 (JAK2) | Janus kinase 2 (a protein tyrosine kinase)
Type:
Protein
Mol. Mass.:
130684.68
Organism:
Homo sapiens (Human)
Description:
O60674
Residue:
1132
  
Inhibitor
Name:
BDBM113214
Synonyms:
US8633206, 133
Type:
Small organic molecule
Emp. Form.:
C20H31N5O3S
Mol. Mass.:
421.557
SMILES:
C[C@@H]1C[C@@H](CS(=O)(=O)N2CC[C@H](CO)C2)CC[C@@H]1N(C)c1ncnc2[nH]ccc12
: