Target
Alpha-galactosidase A
Ligand
BDBM113762
Substrate
Meas. Tech.
α-Gal A Assay
pH
7±0
IC50
0.78± 0.13 nM
Citation
 Yu, YMena-Barragán, TMena-Barragán, KJohnson, JLDrury, JELieberman, RLNakasone, NNinomiya, HTsukimura, TSakuraba, HSuzuki, YNanba, EMellet, COGarcía Fernández, JMGarcía Fernández, K Molecular Basis of 1-Deoxygalactonojirimycin Arylthiourea Binding to Human a-Galactosidase A: Pharmacological Chaperoning Efficacy on Fabry Disease Mutants. ACS Chem Biol 9:1460-9 (2014)  
Target
Name:
Alpha-galactosidase A
Synonyms:
AGAL_HUMAN Alpha-D-galactoside galactohydrolase Alpha-glucosidase A (α-Gal A) INN=Agalsidase | Melibiase
Type:
Protein
Mol. Mass.:
48760.21
Organism:
Homo sapiens (Human)
Description:
Residue:
429
  
Inhibitor
Name:
BDBM113762
Synonyms:
1-Deoxygalactonojirimycin (DGJ) | 2-(hydroxymethyl)piperidine-3,4,5-triol;hydrochloride
Type:
Small organic molecule
Emp. Form.:
C6H13NO4
Mol. Mass.:
163.1717
SMILES:
OCC1NCC(O)C(O)C1O
: