Target
Disintegrin and metalloproteinase domain-containing protein 17
Ligand
BDBM42818
Substrate
Meas. Tech.
Counterscreen for exosite inhibitors of ADAM10: QFRET-based biochemical high throughput dose response assay to identify inhibitors of ADAM17
IC50
69513±n/a nM
Citation
 PubChem, PC Counterscreen for exosite inhibitors of ADAM10: QFRET-based biochemical high throughput dose response assay to identify inhibitors of ADAM17 PubChem Bioassay (2014)[AID] 
Target
Name:
Disintegrin and metalloproteinase domain-containing protein 17
Synonyms:
ADA17_HUMAN CSVP Disintegrin and metalloproteinase domain-containing protein 17 (ADAM17) TNF-alpha convertase TNF-alpha-converting enzyme (TACE) Tumor necrosis factor-α converting enzyme (TACE)
Type:
Enzyme
Mol. Mass.:
93007.89
Organism:
Homo sapiens (Human)
Description:
Residue:
824
  
Inhibitor
Name:
BDBM42818
Synonyms:
3-({4-[(4-phenyl-1-piperazinyl)carbonyl]cyclohexyl}methyl)-2-thioxo-2,3-dihydro-4(1H)-quinazolinone 3-[[4-(4-phenylpiperazine-1-carbonyl)cyclohexyl]methyl]-2-sulfanylidene-1H-quinazolin-4-one 3-[[4-[oxo-(4-phenyl-1-piperazinyl)methyl]cyclohexyl]methyl]-2-sulfanylidene-1H-quinazolin-4-one SMR000076048 | cid_2952511
Type:
Small organic molecule
Emp. Form.:
C26H30N4O2S
Mol. Mass.:
462.607
SMILES:
O=C(C1CCC(Cn2c(=S)[nH]c3ccccc3c2=O)CC1)N1CCN(CC1)c1ccccc1
: