Target
Disintegrin and metalloproteinase domain-containing protein 10
Ligand
BDBM42818
Substrate
Meas. Tech.
QFRET-based biochemical high throughput dose response assay to identify exosite inhibitors of ADAM10.
IC50
69513±n/a nM
Citation
 PubChem, PC QFRET-based biochemical high throughput dose response assay to identify exosite inhibitors of ADAM10. PubChem Bioassay (2014)[AID] 
Target
Name:
Disintegrin and metalloproteinase domain-containing protein 10
Synonyms:
ADA10_HUMAN Disintegrin and metalloproteinase domain-containing protein 10 (ADAM10) MADM
Type:
Enzyme
Mol. Mass.:
84160.93
Organism:
Homo sapiens (Human)
Description:
O14672
Residue:
748
  
Inhibitor
Name:
BDBM42818
Synonyms:
3-({4-[(4-phenyl-1-piperazinyl)carbonyl]cyclohexyl}methyl)-2-thioxo-2,3-dihydro-4(1H)-quinazolinone 3-[[4-(4-phenylpiperazine-1-carbonyl)cyclohexyl]methyl]-2-sulfanylidene-1H-quinazolin-4-one 3-[[4-[oxo-(4-phenyl-1-piperazinyl)methyl]cyclohexyl]methyl]-2-sulfanylidene-1H-quinazolin-4-one SMR000076048 | cid_2952511
Type:
Small organic molecule
Emp. Form.:
C26H30N4O2S
Mol. Mass.:
462.607
SMILES:
O=C(C1CCC(Cn2c(=S)[nH]c3ccccc3c2=O)CC1)N1CCN(CC1)c1ccccc1
: