Target
Disintegrin and metalloproteinase domain-containing protein 10
Ligand
BDBM70806
Substrate
Meas. Tech.
Counterscreen for exosite inhibitors of ADAM17: Fluorescence resonance energy transfer (FRET)-based biochemical high throughput dose response assay to identify inhibitors of ADAM10
IC50
7724±n/a nM
Citation
 PubChem, PC Counterscreen for exosite inhibitors of ADAM17: Fluorescence resonance energy transfer (FRET)-based biochemical high throughput dose response assay to identify inhibitors of ADAM10 PubChem Bioassay (2014)[AID] 
Target
Name:
Disintegrin and metalloproteinase domain-containing protein 10
Synonyms:
ADA10_HUMAN Disintegrin and metalloproteinase domain-containing protein 10 (ADAM10) MADM
Type:
Enzyme
Mol. Mass.:
84160.93
Organism:
Homo sapiens (Human)
Description:
O14672
Residue:
748
  
Inhibitor
Name:
BDBM70806
Synonyms:
10-Furan-2-ylmethyl-12-phenyl-10,12-dihydro-7-oxa-8,10-diaza-benzo[a]anthracen-11-ylideneamine SMR000220659 | cid_4691858
Type:
Small organic molecule
Emp. Form.:
C26H19N3O2
Mol. Mass.:
405.448
SMILES:
N=c1c2C(c3ccccc3)c3c(Oc2ncn1Cc1ccco1)ccc1ccccc31
: