Target
Disintegrin and metalloproteinase domain-containing protein 17
Ligand
BDBM39719
Substrate
Meas. Tech.
QFRET-based biochemical high throughput dose response assay to identify exosite inhibitors of ADAM17
IC50
69501±n/a nM
Citation
 PubChem, PC QFRET-based biochemical high throughput dose response assay to identify exosite inhibitors of ADAM17 PubChem Bioassay (2014)[AID] 
Target
Name:
Disintegrin and metalloproteinase domain-containing protein 17
Synonyms:
ADA17_HUMAN CSVP Disintegrin and metalloproteinase domain-containing protein 17 (ADAM17) TNF-alpha convertase TNF-alpha-converting enzyme (TACE) Tumor necrosis factor-α converting enzyme (TACE)
Type:
Enzyme
Mol. Mass.:
93007.89
Organism:
Homo sapiens (Human)
Description:
Residue:
824
  
Inhibitor
Name:
BDBM39719
Synonyms:
(4-chlorophenyl)-[2-(3-chlorophenyl)-5-methyl-pyrazol-3-yl]amine 2-(3-chlorophenyl)-N-(4-chlorophenyl)-5-methyl-pyrazol-3-amine MLS000536181 cid_2408836
Type:
Small organic molecule
Emp. Form.:
C16H13Cl2N3
Mol. Mass.:
318.201
SMILES:
Cc1cc(Nc2ccc(Cl)cc2)n(n1)-c1cccc(Cl)c1
: