Target
Tyrosyl-DNA phosphodiesterase 2
Ligand
BDBM53380
Substrate
Meas. Tech.
Epi Absorbance-based biochemical high throughput dose response assay to identify inhibitors of human tyrosyl-DNA phosphodiesterase 2 (TDP2)
IC50
128309±n/a nM
Citation
 PubChem, PC Epi Absorbance-based biochemical high throughput dose response assay to identify inhibitors of human tyrosyl-DNA phosphodiesterase 2 (TDP2) PubChem Bioassay (2014)[AID] 
Target
Name:
Tyrosyl-DNA phosphodiesterase 2
Synonyms:
EAP2 ETS1-associated protein 2 TDP2 TTRAP Tyr-DNA phosphodiesterase 2 Tyrosyl-DNA phosphodiesterase 2 (hTDP2) VPg unlinkase | hTDP2
Type:
Enzyme Catalytic Domain
Mol. Mass.:
40916.54
Organism:
Homo sapiens (Human)
Description:
gi_23510348
Residue:
362
  
Inhibitor
Name:
BDBM53380
Synonyms:
MLS001332477 Sennoside A | cid_16218404
Type:
Small organic molecule
Emp. Form.:
C42H38O20
Mol. Mass.:
862.7391
SMILES:
[H][C@]1(c2cccc(OC3O[C@H](CO)[C@@H](O)[C@H](O)[C@H]3O)c2C(=O)c2c(O)cc(cc12)C(O)=O)[C@]1([H])c2cccc(O[C@@H]3O[C@H](CO)[C@@H](O)[C@H](O)[C@H]3O)c2C(=O)c2c(O)cc(cc12)C(O)=O
: