Target
1-phosphatidylinositol 4,5-bisphosphate phosphodiesterase beta-3
Ligand
BDBM114216
Substrate
Meas. Tech.
Fluorescence-based biochemical high throughput dose response assay to identify inhibitors of phospholipase C isozymes (PLC-B3)
IC50
122521±n/a nM
Citation
 PubChem, PC Fluorescence-based biochemical high throughput dose response assay to identify inhibitors of phospholipase C isozymes (PLC-B3) PubChem Bioassay (2014)[AID] 
Target
Name:
1-phosphatidylinositol 4,5-bisphosphate phosphodiesterase beta-3
Synonyms:
PLCB3 Phospholipase C, beta 3 (phosphatidylinositol-specific) | Phospholipase C-beta-3
Type:
PROTEIN
Mol. Mass.:
138786.29
Organism:
Homo sapiens (Human)
Description:
EBI_12586
Residue:
1234
  
Inhibitor
Name:
BDBM114216
Synonyms:
2-[(5-cyano-3,3,8-trimethyl-1,4-dihydropyrano[3,4-c]pyridin-6-yl)oxy]acetic acid methyl ester SMR000041572 methyl 2-[(5-cyano-3,3,8-trimethyl-1,4-dihydropyrano[3,4-c]pyridin-6-yl)oxy]acetate | methyl 2-[(5-cyano-3,3,8-trimethyl-1,4-dihydropyrano[3,4-c]pyridin-6-yl)oxy]ethanoate
Type:
Small organic molecule
Emp. Form.:
C15H18N2O4
Mol. Mass.:
290.3144
SMILES:
COC(=O)COc1nc(C)c2COC(C)(C)Cc2c1C#N
: