Target
Epidermal growth factor receptor
Ligand
BDBM4567
Substrate
EGF-R Tyrosine Kinase
Meas. Tech.
Kinase Inhibition Assay
pH
7.4±n/a
Temperature
295.15±n/a K
IC50
2±n/a nM
Citation
 Tsou, HRMamuya, NJohnson, BDReich, MFGruber, BCYe, FNilakantan, RShen, RDiscafani, CDeBlanc, RDavis, RKoehn, FEGreenberger, LMWang, YFWissner, A 6-Substituted-4-(3-bromophenylamino)quinazolines as putative irreversible inhibitors of the epidermal growth factor receptor (EGFR) and human epidermal growth factor receptor (HER-2) tyrosine kinases with enhanced antitumor activity. J Med Chem 44:2719-34 (2001)  
Target
Name:
Epidermal growth factor receptor
Synonyms:
EGF Receptor Substrate EGFR_HUMAN ERBB1 Epidermal Growth Factor Receptor erbB-1 Epidermal growth factor receptor (EGFR) HER1 Proto-oncogene c-ErbB-1 Tyrosine-Protein Kinase ErbB-1
Type:
Receptor Kinase Domain
Mol. Mass.:
134279.59
Organism:
Homo sapiens (Human)
Description:
P00533
Residue:
1210
  
Inhibitor
Name:
BDBM4567
Synonyms:
4-anilinoquinazoline deriv. 2 CHEMBL285063 US9422297, PD168393
Type:
Small organic molecule
Emp. Form.:
C17H13BrN4O
Mol. Mass.:
369.215
SMILES:
Brc1cccc(Nc2ncnc3ccc(NC(=O)C=C)cc23)c1
:
Substrate
Name:
Epidermal growth factor receptor
Synonyms:
EGF Receptor Substrate EGFR_HUMAN ERBB1 Epidermal Growth Factor Receptor erbB-1 Epidermal growth factor receptor (EGFR) HER1 Proto-oncogene c-ErbB-1 Tyrosine-Protein Kinase ErbB-1
Type:
Receptor Kinase Domain
Mol. Mass.:
134279.59
Organism:
Homo sapiens (Human)
Description:
P00533
Residue:
1210