Target
Major prion protein
Ligand
BDBM41000
Substrate
Meas. Tech.
TRFRET-based cell-based high throughput dose response assay to identify inhibitors of cell surface Prion Protein (PRPC)
IC50
1079±n/a nM
Citation
 PubChem, PC TRFRET-based cell-based high throughput dose response assay to identify inhibitors of cell surface Prion Protein (PRPC) PubChem Bioassay (2014)[AID] 
Target
Name:
Major prion protein
Synonyms:
ALTPRP CD_antigen=CD230 PRIP PRP PrP33-35C major prion protein preproprotein
Type:
PROTEIN
Mol. Mass.:
27671.97
Organism:
Homo sapiens (Human)
Description:
ChEMBL_158887
Residue:
253
  
Inhibitor
Name:
BDBM41000
Synonyms:
(2-Isopropyl-quinazolin-4-ylsulfanyl)-acetic acid ethyl ester 2-[(2-propan-2-yl-4-quinazolinyl)thio]acetic acid ethyl ester SMR000122408 ethyl 2-(2-propan-2-ylquinazolin-4-yl)sulfanylacetate | ethyl 2-(2-propan-2-ylquinazolin-4-yl)sulfanylethanoate
Type:
Small organic molecule
Emp. Form.:
C15H18N2O2S
Mol. Mass.:
290.381
SMILES:
CCOC(=O)CSc1nc(nc2ccccc12)C(C)C
: