Target
Major prion protein
Ligand
BDBM114399
Substrate
Meas. Tech.
TRFRET-based cell-based high throughput dose response assay to identify inhibitors of cell surface Prion Protein (PRPC)
IC50
2084±n/a nM
Citation
 PubChem, PC TRFRET-based cell-based high throughput dose response assay to identify inhibitors of cell surface Prion Protein (PRPC) PubChem Bioassay (2014)[AID] 
Target
Name:
Major prion protein
Synonyms:
ALTPRP CD_antigen=CD230 PRIP PRP PrP33-35C major prion protein preproprotein
Type:
PROTEIN
Mol. Mass.:
27671.97
Organism:
Homo sapiens (Human)
Description:
ChEMBL_158887
Residue:
253
  
Inhibitor
Name:
BDBM114399
Synonyms:
4'-(1-benzofuran-2-carbonyl)-1-ethyl-3'-hydroxy-1'-(3-morpholin-4-ylpropyl)spiro[indole-3,5'-pyrrole]-2,2'-dione 4'-[2-benzofuranyl(oxo)methyl]-1-ethyl-3'-hydroxy-1'-[3-(4-morpholinyl)propyl]spiro[indole-3,5'-pyrrole]-2,2'-dione MLS000762609 cid_3363660
Type:
Small organic molecule
Emp. Form.:
C29H29N3O6
Mol. Mass.:
515.5571
SMILES:
CCN1C(=O)C2(C(C(=O)c3cc4ccccc4o3)C(=O)C(=O)N2CCCN2CCOCC2)c2ccccc12
: