Target
Group 3 secretory phospholipase A2
Ligand
BDBM65289
Substrate
Meas. Tech.
QFRET-based biochemical high throughput dose response assay to identify inhibitors of human group III secreted phospholipase A2 enzyme (HGIII-sPLA2)
IC50
121831±n/a nM
Citation
 PubChem, PC QFRET-based biochemical high throughput dose response assay to identify inhibitors of human group III secreted phospholipase A2 enzyme (HGIII-sPLA2) PubChem Bioassay (2014)[AID] 
Target
Name:
Group 3 secretory phospholipase A2
Synonyms:
3.1.1.4 Group III secretory phopholipase A2 PA2G3_HUMAN Phosphatidylcholine 2-acylhydrolase 3 sPLA2-III
Type:
PROTEIN
Mol. Mass.:
57196.58
Organism:
Homo sapiens
Description:
ChEMBL_119722
Residue:
509
  
Inhibitor
Name:
BDBM65289
Synonyms:
(E)-N-[(salicyloylamino)thiocarbamoyl]-3-(2-thienyl)acrylamide (E)-N-[[(2-hydroxyphenyl)carbonylamino]carbamothioyl]-3-thiophen-2-yl-prop-2-enamide MLS000703259 cid_5763840
Type:
Small organic molecule
Emp. Form.:
C15H13N3O3S2
Mol. Mass.:
347.412
SMILES:
Oc1ccccc1C(=O)NNC(=S)NC(=O)\C=C\c1cccs1
: