Target
Oxysterols receptor LXR-beta
Ligand
BDBM115112
Substrate
Meas. Tech.
Counterscreen for agonists of the daf-12 abnormal Dauer Formation: Luminescence-based cell-based dose response screening assay to identify agonists of the Liver-X-Receptor (LXR)
EC50
67535±n/a nM
Citation
 PubChem, PC Counterscreen for agonists of the daf-12 abnormal Dauer Formation: Luminescence-based cell-based dose response screening assay to identify agonists of the Liver-X-Receptor (LXR) PubChem Bioassay (2013)[AID] 
Target
Name:
Oxysterols receptor LXR-beta
Synonyms:
LXRB Liver X, LXR beta NR1H2 Nuclear receptor NER Ubiquitously-expressed nuclear receptor
Type:
Enzyme Catalytic Domain
Mol. Mass.:
50978.79
Organism:
Homo sapiens (Human)
Description:
P55055
Residue:
460
  
Inhibitor
Name:
BDBM115112
Synonyms:
(3S,3aR)-1-allyl-2-keto-3-(2-keto-2-thiomorpholino-ethyl)-4,5,6,7-tetrahydro-3H-cyclohepta[b]pyrrole-3a-carboxylic acid methyl ester MLS004259454 cid_60158113 methyl (3S,3aR)-2-oxo-3-(2-oxo-2-thiomorpholin-4-ylethyl)-1-prop-2-enyl-4,5,6,7-tetrahydro-3H-cyclohepta[b]pyrrole-3a-carboxylate
Type:
Small organic molecule
Emp. Form.:
C20H28N2O4S
Mol. Mass.:
392.512
SMILES:
COC(=O)[C@@]12CCCCC=C1N(CC=C)C(=O)[C@H]2CC(=O)N1CCSCC1
: