Target
Lysine-specific histone demethylase 1A
Ligand
BDBM113730
Substrate
Meas. Tech.
GST-LSD1 Enzymatic Assays
pH
7.5±n/a
Ki
5.0e+3± 1.1e+3 nM
Comments
extracted
Citation
 Prusevich, PKalin, JHMing, SABasso, MGivens, JLi, XHu, JTaylor, MSCieniewicz, AMHsiao, PYHuang, RRoberson, HAdejola, NAvery, LBCasero, RATaverna, SDQian, JTackett, AJRatan, RRMcDonald, OGFeinberg, APCole, PA A Selective Phenelzine Analogue Inhibitor of Histone Demethylase LSD1. ACS Chem Biol 9:1284-93 (2014)  
Target
Name:
Lysine-specific histone demethylase 1A
Synonyms:
AOF2 Flavin-containing amine oxidase domain-containing protein 2 KDM1A KIAA0601 Lysine-specific demethylase 1 (LSD1) Lysine-specific histone demethylase 1 (LSD1)
Type:
Enzyme
Mol. Mass.:
92901.01
Organism:
Homo sapiens (Human)
Description:
O60341
Residue:
852
  
Inhibitor
Name:
BDBM113730
Synonyms:
(3-Phenylpropyl)hydrazine dihydrochloride salt (9c)
Type:
Small organic molecule
Emp. Form.:
C9H14N2
Mol. Mass.:
150.2209
SMILES:
NNCCCc1ccccc1
: