Target
Lysine-specific histone demethylase 1A
Ligand
BDBM113732
Substrate
Meas. Tech.
GST-LSD1 Enzymatic Assays
pH
7.5±n/a
Ki
8.0e+3± 3.5e+3 nM
Comments
extracted
Citation
 Prusevich, PKalin, JHMing, SABasso, MGivens, JLi, XHu, JTaylor, MSCieniewicz, AMHsiao, PYHuang, RRoberson, HAdejola, NAvery, LBCasero, RATaverna, SDQian, JTackett, AJRatan, RRMcDonald, OGFeinberg, APCole, PA A Selective Phenelzine Analogue Inhibitor of Histone Demethylase LSD1. ACS Chem Biol 9:1284-93 (2014)  
Target
Name:
Lysine-specific histone demethylase 1A
Synonyms:
AOF2 Flavin-containing amine oxidase domain-containing protein 2 KDM1A KIAA0601 Lysine-specific demethylase 1 (LSD1) Lysine-specific histone demethylase 1 (LSD1)
Type:
Enzyme
Mol. Mass.:
92901.01
Organism:
Homo sapiens (Human)
Description:
O60341
Residue:
852
  
Inhibitor
Name:
BDBM113732
Synonyms:
[3-(4-Methoxyphenyl)propyl]hydrazine dihydrochloride salt (9e)
Type:
Small organic molecule
Emp. Form.:
C10H16N2O
Mol. Mass.:
180.2468
SMILES:
COc1ccc(CCCNN)cc1
: