Target
Amine oxidase [flavin-containing] B
Ligand
BDBM50105417
Substrate
Meas. Tech.
MAO-A/B Activity and Inhibition Assay
pH
7.5±n/a
Ki
3.9e+3± 1.7e+3 nM
Comments
extracted
Citation
 Prusevich, PKalin, JHMing, SABasso, MGivens, JLi, XHu, JTaylor, MSCieniewicz, AMHsiao, PYHuang, RRoberson, HAdejola, NAvery, LBCasero, RATaverna, SDQian, JTackett, AJRatan, RRMcDonald, OGFeinberg, APCole, PA A Selective Phenelzine Analogue Inhibitor of Histone Demethylase LSD1. ACS Chem Biol 9:1284-93 (2014)  
Target
Name:
Amine oxidase [flavin-containing] B
Synonyms:
AOFB_HUMAN MAOB Monoamine oxidase type B (MAO B) Monoamine oxidase type B (MAOB)
Type:
Protein
Mol. Mass.:
58768.76
Organism:
Homo sapiens (Human)
Description:
P27338
Residue:
520
  
Inhibitor
Name:
BDBM50105417
Synonyms:
CHEMBL1089 PHENELZINE | Phenethyl-hydrazine
Type:
Small organic molecule
Emp. Form.:
C8H12N2
Mol. Mass.:
136.1943
SMILES:
NNCCc1ccccc1
: