Target
cAMP and cAMP-inhibited cGMP 3',5'-cyclic phosphodiesterase 10A
Ligand
BDBM115548
Substrate
Meas. Tech.
Enzyme Inhibition Assay
Temperature
298.15±n/a K
IC50
442.3±n/a nM
Comments
extracted
Citation
 Allen, JRChen, NFalsey, JRFrohn, MJHarrington, PEHarrington, EHKaller, MRKunz, RKNguyen, TTPickrell, AJReichelt, ARumfelt, SRzasa, RMSham, KSiegmund, ACYao, G Aminopyridine and carboxypyridine compounds as phosphodiesterase 10 inhibitors US Patent  US8637500 Publication Date 1/28/2014 
Target
Name:
cAMP and cAMP-inhibited cGMP 3',5'-cyclic phosphodiesterase 10A
Synonyms:
PDE10_RAT Phosphodiesterase 10 Phosphodiesterase Type 10 (PDE10A) | Rat recombinant PDE10a (rPDE10a)
Type:
Enzyme
Mol. Mass.:
90160.88
Organism:
Rattus norvegicus (rat)
Description:
PDE10A was generated from the full-length recombinant rat clone transfected into Sf9 cells.
Residue:
794
  
Inhibitor
Name:
BDBM115548
Synonyms:
US8637500, 431
Type:
Small organic molecule
Emp. Form.:
C25H19N5O2
Mol. Mass.:
421.4507
SMILES:
O=C(NC(C#N)c1ccccc1)c1cccnc1Oc1ccc(Nc2ccccn2)cc1
: