Target
Serine/threonine-protein kinase mTOR
Ligand
BDBM115619
Substrate
Meas. Tech.
mTOR Kinase Activity Assay
IC50
109±n/a nM
Citation
 Schneider, SKessler, Dvan der Veen, LWunberg, T 5-alkynyl-pyrimidines US Patent  US8633183 Publication Date 1/21/2014 
Target
Name:
Serine/threonine-protein kinase mTOR
Synonyms:
FK506-binding protein 12-rapamycin complex-associated protein 1 FRAP FRAP1 MTOR Mammalian Target of Rapamycin (mTOR) RAFT1 Rapamycin and FKBP12 target 1 Serine/threonine-protein kinase (mTOR) | mTORC2
Type:
Rapamycin target protein
Mol. Mass.:
288917.12
Organism:
Homo sapiens (Human)
Description:
P42345
Residue:
2549
  
Inhibitor
Name:
BDBM115619
Synonyms:
US8633183, C-44
Type:
Small organic molecule
Emp. Form.:
C24H25N5O
Mol. Mass.:
399.4882
SMILES:
CCN(CC)C(=O)c1cccc(c1)-c1ncnc(CC)c1C#Cc1ccc(N)nc1
: