Target
Beta-secretase 1
Ligand
BDBM116247
Substrate
Meas. Tech.
Inhibition Assay
pH
4.5±n/a
Temperature
298.15±n/a K
IC50
6±n/a nM
Comments
extracted
Citation
 Badiger, SChebrolu, MHurth, KJacquier, SLueoend, RMMachauer, RRueeger, HTintelnot-Blomley, MVeenstra, SJVoegtle, M Heterocyclic derivatives and their use in the treatment of neurological disorders US Patent  US8637508 Publication Date 1/28/2014 
Target
Name:
Beta-secretase 1
Synonyms:
ASP2 Aspartyl protease 2 BACE1 Beta-secretase (BACE) Beta-secretase 1 (BACE 1) Beta-secretase 1 (BACE1) Beta-site amyloid precursor protein cleaving enzyme 1 Memapsin-2 beta-Secretase (BACE-1) | beta-Secretase (BACE1)
Type:
Protein
Mol. Mass.:
55755.10
Organism:
Homo sapiens (Human)
Description:
P56817
Residue:
501
  
Inhibitor
Name:
BDBM116247
Synonyms:
US10035794, Example 24 US8637508, 24
Type:
Small organic molecule
Emp. Form.:
C19H15ClF4N6O2
Mol. Mass.:
470.808
SMILES:
C[C@]1(CO[C@](C)(C(N)=N1)C(F)(F)F)c1nc(NC(=O)c2ncc(cc2Cl)C#N)ccc1F
: