Target
Beta-secretase 2
Ligand
BDBM116237
Substrate
Meas. Tech.
Inhibition Assay
pH
4.5±n/a
Temperature
298.15±n/a K
IC50
1300±n/a nM
Comments
extracted
Citation
 Badiger, SChebrolu, MHurth, KJacquier, SLueoend, RMMachauer, RRueeger, HTintelnot-Blomley, MVeenstra, SJVoegtle, M Heterocyclic derivatives and their use in the treatment of neurological disorders US Patent  US8637508 Publication Date 1/28/2014 
Target
Name:
Beta-secretase 2
Synonyms:
AEPLC ASP1 Asp 1 Aspartyl protease 1 BACE2_HUMAN Beta-secretase (BACE) Beta-secretase 2 (BACE-2) Beta-site APP-cleaving enzyme 2 Memapsin-1 beta-Secretase (BACE-2)
Type:
Protein
Mol. Mass.:
56171.20
Organism:
Homo sapiens (Human)
Description:
Q9Y5Z0
Residue:
518
  
Inhibitor
Name:
BDBM116237
Synonyms:
US10035794, Example 12 US8637508, 12
Type:
Small organic molecule
Emp. Form.:
C20H18F4N6O2
Mol. Mass.:
450.3895
SMILES:
Cc1cc(cnc1C(=O)Nc1ccc(F)c(n1)[C@@]1(C)CO[C@](C)(C(N)=N1)C(F)(F)F)C#N
: