Target
cAMP-specific 3',5'-cyclic phosphodiesterase 7B
Ligand
BDBM50151526
Substrate
Meas. Tech.
Scintillation Proximity Assay
pH
8±n/a
IC50
144±n/a nM
Comments
extracted
Citation
 Bergmann, JECutshall, NSDemopulos, GAFlorio, VAGaitanaris, GGray, PHohmann, JOnrust, RZeng, H Use of PDE7 inhibitors for the treatment of movement disorders US Patent  US8637528 Publication Date 1/28/2014 
Target
Name:
cAMP-specific 3',5'-cyclic phosphodiesterase 7B
Synonyms:
3',5'-cyclic phosphodiesterase PDE7B_HUMAN Phosphodiesterase 7B (PDE7B) | cAMP-specific 3',5'-cyclic phosphodiesterase 7B
Type:
Enzyme
Mol. Mass.:
51842.76
Organism:
Homo sapiens (Human)
Description:
Q9NP56
Residue:
450
  
Inhibitor
Name:
BDBM50151526
Synonyms:
CHEMBL363097 US8637528, OM956
Type:
Small organic molecule
Emp. Form.:
C17H22N4OS
Mol. Mass.:
330.448
SMILES:
CC(=O)Nc1ccc(cc1)-c1nn(C)\c(=N\C2CCCCC2)s1
: