Target
Ribosomal protein S6 kinase beta-1
Ligand
BDBM116746
Substrate
Meas. Tech.
Enzyme Assay
pH
7.5±n/a
Temperature
298.15±n/a K
IC50
48±n/a nM
Comments
extracted
Citation
 Sutton, AELan, RRichardson, TEPerrey, DVandeveer, HGHuck, BRKarra, SRChen, XXiao, YLiu-Bujalski, LGoutopoulos, AStieber, FHodous, BLQiu, HJones, RHeasley, BH Amino azaheterocyclic carboxamides US Patent  US8637532 Publication Date 1/28/2014 
Target
Name:
Ribosomal protein S6 kinase beta-1
Synonyms:
70 kDa ribosomal protein S6 kinase 1 70 kDa ribosomal protein kinase (p70S6K) Protein kinase 70S6K (T412E) RPS6KB1 Ribosomal protein S6 kinase I STK14A p70S6K1
Type:
Enzyme
Mol. Mass.:
59139.89
Organism:
Homo sapiens (Human)
Description:
His-tagged S6K1.
Residue:
525
  
Inhibitor
Name:
BDBM116746
Synonyms:
US8637532, 458
Type:
Small organic molecule
Emp. Form.:
C28H30N6O3
Mol. Mass.:
498.5762
SMILES:
COc1ccc(cc1)C(=O)Nc1cccc(c1)C(CCN(C)C)Nc1ncnc2c(cccc12)C(N)=O
: